Reaction Details
TargetHistamine H3 receptor
LigandBDBM50263325
Substrate/Competitorn/a
Meas. Tech.ChEMBL_535494 (CHEMBL986121)
IC50 18±n/a nM
Citation Jitsuoka, MTsukahara, DIto, STanaka, TTakenaga, NTokita, SSato, N Synthesis and evaluation of a spiro-isobenzofuranone class of histamine H3 receptor inverse agonists. Bioorg Med Chem Lett18:5101-6 (2008) 
 
Histamine H3 receptor
Name:Histamine H3 receptor
Type:G Protein-Coupled Receptor (GPCR)
Mol. Mass.:48691.47
Organism:Homo sapiens (Human)
Description:Binding assays were using CHO cells stably expressing hH3R receptors.
Residue:445
BDBM50263325
NameBDBM50263325
Synonyms:CHEMBL507921 | trans-6'-Methoxy-3'-oxo-3'H-spiro[cyclohexane-1,1'-isobenzofuran]-4-carboxylic acid methyl-(2-piperidin-1-yl-ethyl)-amide
TypeSmall organic molecule
Emp. Form.C23H32N2O4
Mol. Mass.400.5112
SMILESCOc1ccc2C(=O)O[C@]3(CC[C@@H](CC3)C(=O)N(C)CCN3CCCCC3)c2c1