Reaction Details
TargetHistamine H2 receptor
LigandBDBM50263324
Substrate/Competitorn/a
Meas. Tech.ChEMBL_535496 (CHEMBL986123)
IC50>10000±n/a nM
Citation Jitsuoka, MTsukahara, DIto, STanaka, TTakenaga, NTokita, SSato, N Synthesis and evaluation of a spiro-isobenzofuranone class of histamine H3 receptor inverse agonists. Bioorg Med Chem Lett18:5101-6 (2008) 
 
Histamine H2 receptor
Name:Histamine H2 receptor
Type:G Protein-Coupled Receptor (GPCR)
Mol. Mass.:40115.31
Organism:Homo sapiens (Human)
Description:n/a
Residue:359
BDBM50263324
NameBDBM50263324
Synonyms:CHEMBL513893 | trans-5'-Methoxy-3'-oxo-3'H-spiro[cyclohexane-1,1'-isobenzofuran]-4-carboxylic acid methyl-(2-piperidin-1-yl-ethyl)-amide
TypeSmall organic molecule
Emp. Form.C23H32N2O4
Mol. Mass.400.5112
SMILESCOc1ccc2c(c1)C(=O)O[C@]21CC[C@@H](CC1)C(=O)N(C)CCN1CCCCC1