Reaction Details
TargetD(2) dopamine receptor
LigandBDBM50253662
Substrate/Competitorn/a
Meas. Tech.ChEMBL_538660 (CHEMBL1033058)
Ki 11.7±n/a nM
Citation Paul, NMTaylor, MKumar, RDeschamps, JRLuedtke, RRNewman, AH Structure-activity relationships for a novel series of dopamine D2-like receptor ligands based on N-substituted 3-aryl-8-azabicyclo[3.2.1]octan-3-ol. J Med Chem51:6095-109 (2008) 
 
D(2) dopamine receptor
Name:D(2) dopamine receptor
Type:Cell-surface receptors
Mol. Mass.:50647.10
Organism:Homo sapiens (Human)
Description:P14416
Residue:443
BDBM50253662
NameBDBM50253662
Synonyms:CHEMBL460985 | endo-8-(Naphtho[2,1-b]fur-1-ylmethyl)-3-(4-chlorophenyl)-8-azabicyclo[3.2.1]octan-3-ol
TypeSmall organic molecule
Emp. Form.C26H24ClNO2
Mol. Mass.417.927
SMILESOC1(CC2CCC(C1)N2Cc1coc2ccc3ccccc3c12)c1ccc(Cl)cc1