Reaction Details
TargetD(2) dopamine receptor
LigandBDBM50253636
Substrate/Competitorn/a
Meas. Tech.ChEMBL_538660 (CHEMBL1033058)
Ki 1.5±n/a nM
Citation Paul, NMTaylor, MKumar, RDeschamps, JRLuedtke, RRNewman, AH Structure-activity relationships for a novel series of dopamine D2-like receptor ligands based on N-substituted 3-aryl-8-azabicyclo[3.2.1]octan-3-ol. J Med Chem51:6095-109 (2008) 
 
D(2) dopamine receptor
Name:D(2) dopamine receptor
Type:Cell-surface receptors
Mol. Mass.:50647.10
Organism:Homo sapiens (Human)
Description:P14416
Residue:443
BDBM50253636
NameBDBM50253636
Synonyms:CHEMBL461835 | endo-8-(Benzofur-3-ylmethyl)-3-(4-bromophenyl)-8-azabicyclo-[3.2.1]octan-3-ol
TypeSmall organic molecule
Emp. Form.C22H22BrNO2
Mol. Mass.412.32
SMILESOC1(CC2CCC(C1)N2Cc1coc2ccccc12)c1ccc(Br)cc1