Reaction Details
TargetD(3) dopamine receptor
LigandBDBM50253585
Substrate/Competitorn/a
Meas. Tech.ChEMBL_538661 (CHEMBL1033059)
Ki 21.2±n/a nM
Citation Paul, NMTaylor, MKumar, RDeschamps, JRLuedtke, RRNewman, AH Structure-activity relationships for a novel series of dopamine D2-like receptor ligands based on N-substituted 3-aryl-8-azabicyclo[3.2.1]octan-3-ol. J Med Chem51:6095-109 (2008) 
 
D(3) dopamine receptor
Name:D(3) dopamine receptor
Type:n/a
Mol. Mass.:44243.43
Organism:Homo sapiens (Human)
Description:n/a
Residue:400
BDBM50253585
NameBDBM50253585
Synonyms:CHEMBL521648 | endo-8-(5-Methoxy-1H-indol-3-ylmethyl)-3-(4-chlorophenyl)-8-azabicyclo[3.2.1]octan-3-ol
TypeSmall organic molecule
Emp. Form.C23H25ClN2O2
Mol. Mass.396.91
SMILESCOc1ccc2[nH]cc(CN3C4CCC3CC(O)(C4)c3ccc(Cl)cc3)c2c1