Reaction Details
TargetIntegrin alpha-L
LigandBDBM50263598
Substrate/Competitorn/a
Meas. Tech.ChEMBL_535592 (CHEMBL987066)
IC50 28±n/a nM
Citation Guckian, KMLin, EYSilvian, LFriedman, JEChin, DScott, DM Design and synthesis of a series of meta aniline-based LFA-1 ICAM inhibitors. Bioorg Med Chem Lett18:5249-51 (2008) 
 
Integrin alpha-L
Name:Integrin alpha-L
Type:PROTEIN
Mol. Mass.:128748.90
Organism:Homo sapiens (Human)
Description:ChEMBL_629045
Residue:1170
BDBM50263598
NameBDBM50263598
Synonyms:(E)-3-(4-(3-(cyclohexylamino)phenylthio)-2,3-bis(trifluoromethyl)phenyl)-1-morpholinoprop-2-en-1-one | CHEMBL478216
TypeSmall organic molecule
Emp. Form.C27H28F6N2O2S
Mol. Mass.558.579
SMILESFC(F)(F)c1c(Sc2cccc(NC3CCCCC3)c2)ccc(\C=C\C(=O)N2CCOCC2)c1C(F)(F)F