Reaction Details
TargetIntegrin alpha-L
LigandBDBM50263757
Substrate/Competitorn/a
Meas. Tech.ChEMBL_535592 (CHEMBL987066)
IC50 0.35±n/a nM
Citation Guckian, KMLin, EYSilvian, LFriedman, JEChin, DScott, DM Design and synthesis of a series of meta aniline-based LFA-1 ICAM inhibitors. Bioorg Med Chem Lett18:5249-51 (2008) 
 
Integrin alpha-L
Name:Integrin alpha-L
Type:PROTEIN
Mol. Mass.:128748.90
Organism:Homo sapiens (Human)
Description:ChEMBL_629045
Residue:1170
BDBM50263757
NameBDBM50263757
Synonyms:(E)-3-(4-(3-(1-isopropylpiperidin-4-ylamino)phenylthio)-2,3-bis(trifluoromethyl)phenyl)-1-morpholinoprop-2-en-1-one | CHEMBL488318
TypeSmall organic molecule
Emp. Form.C29H33F6N3O2S
Mol. Mass.601.647
SMILESCC(C)N1CCC(CC1)Nc1cccc(Sc2ccc(\C=C\C(=O)N3CCOCC3)c(c2C(F)(F)F)C(F)(F)F)c1