Reaction Details
TargetMelatonin receptor type 1B
LigandBDBM9019
Substrate/Competitorn/a
Meas. Tech.ChEMBL_535638 (CHEMBL987966)
EC50 0.49±n/a nM
Citation Poissonnier-Durieux, SEttaoussi, MPérès, BBoutin, JAAudinot, VBennejean, CDelagrange, PCaignard, DHRenard, PBerthelot, PLesieur, DYous, S Synthesis of 3-phenylnaphthalenic derivatives as new selective MT(2) melatoninergic ligands. Bioorg Med Chem16:8339-48 (2008) 
 
Melatonin receptor type 1B
Name:Melatonin receptor type 1B
Type:Enzyme
Mol. Mass.:40203.54
Organism:Homo sapiens (Human)
Description:P49286
Residue:362
BDBM9019
NameBDBM9019
Synonyms:CHEMBL45 N-[2-(5-methoxy-1H-indol-3-yl)ethyl]acetamide
TypeSmall organic molecule
Emp. Form.C13H16N2O2
Mol. Mass.232.2783
SMILESCOc1ccc2[nH]cc(CCNC(C)=O)c2c1