Reaction Details
TargetDipeptidyl peptidase 4
LigandBDBM50253641
Substrate/Competitorn/a
Meas. Tech.ChEMBL_538997 (CHEMBL1035671)
Ki 3300±n/a nM
Citation Connolly, BASanford, DGChiluwal, AKHealey, SEPeters, DEDimare, MTWu, WLiu, YMaw, HZhou, YLi, YJin, ZSudmeier, JLLai, JHBachovchin, WW Dipeptide boronic acid inhibitors of dipeptidyl peptidase IV: determinants of potency and in vivo efficacy and safety. J Med Chem51:6005-13 (2008) 
 
Dipeptidyl peptidase 4
Name:Dipeptidyl peptidase 4
Type:Enzyme
Mol. Mass.:88271.01
Organism:Homo sapiens (Human)
Description:P27487
Residue:766
BDBM50253641
NameBDBM50253641
Synonyms:(R)-1-((S)-2-acetamido-3-methylbutanoyl)pyrrolidin-2-ylboronic acid | CHEMBL460984
TypeSmall organic molecule
Emp. Form.C11H21BN2O4
Mol. Mass.256.106
SMILESCC(C)[C@H](NC(C)=O)C(=O)N1CCC[C@H]1B(O)O