Reaction Details
TargetDipeptidyl peptidase 8
LigandBDBM50050511
Substrate/Competitorn/a
Meas. Tech.ChEMBL_538996 (CHEMBL1035670)
Ki 3.1±n/a nM
Citation Connolly, BASanford, DGChiluwal, AKHealey, SEPeters, DEDimare, MTWu, WLiu, YMaw, HZhou, YLi, YJin, ZSudmeier, JLLai, JHBachovchin, WW Dipeptide boronic acid inhibitors of dipeptidyl peptidase IV: determinants of potency and in vivo efficacy and safety. J Med Chem51:6005-13 (2008) 
 
Dipeptidyl peptidase 8
Name:Dipeptidyl peptidase 8
Type:Enzyme
Mol. Mass.:103342.62
Organism:Homo sapiens (Human)
Description:Q6V1X1
Residue:898
BDBM50050511
NameBDBM50050511
Synonyms:(R)-1-(2-aminoacetyl)pyrrolidin-2-ylboronic acid CHEMBL67089
TypeSmall organic molecule
Emp. Form.C6H13BN2O3
Mol. Mass.171.99
SMILESNCC(=O)N1CCC[C@H]1B(O)O