Reaction Details
TargetDipeptidyl peptidase 9
LigandBDBM50253621
Substrate/Competitorn/a
Meas. Tech.ChEMBL_538995 (CHEMBL1035669)
Ki 2.6±n/a nM
Citation Connolly, BASanford, DGChiluwal, AKHealey, SEPeters, DEDimare, MTWu, WLiu, YMaw, HZhou, YLi, YJin, ZSudmeier, JLLai, JHBachovchin, WW Dipeptide boronic acid inhibitors of dipeptidyl peptidase IV: determinants of potency and in vivo efficacy and safety. J Med Chem51:6005-13 (2008) 
 
Dipeptidyl peptidase 9
Name:Dipeptidyl peptidase 9
Type:Enzyme
Mol. Mass.:98260.70
Organism:Homo sapiens (Human)
Description:Q86TI2
Residue:863
BDBM50253621
NameBDBM50253621
Synonyms:(S)-4-amino-5-((R)-2-boronopyrrolidin-1-yl)-5-oxopentanoic acid US11096924, DASH-inhibitors 8120 | US11559537, Compound 8120
TypeSmall organic molecule
Emp. Form.C9H17BN2O5
Mol. Mass.244.053
SMILESN[C@@H](CCC(O)=O)C(=O)N1CCC[C@H]1B(O)O