Reaction Details
TargetIntegrin alpha-L
LigandBDBM50265189
Substrate/Competitorn/a
Meas. Tech.ChEMBL_497066 (CHEMBL997702)
IC50 55±n/a nM
Citation Lin, EYGuckian, KMSilvian, LChin, DBoriack-Sjodin, PAvan Vlijmen, HFriedman, JEScott, DM Structure-activity relationship of ortho- and meta-phenol based LFA-1 ICAM inhibitors. Bioorg Med Chem Lett18:5245-8 (2008) 
 
Integrin alpha-L
Name:Integrin alpha-L
Type:PROTEIN
Mol. Mass.:128748.90
Organism:Homo sapiens (Human)
Description:ChEMBL_629045
Residue:1170
BDBM50265189
NameBDBM50265189
Synonyms:(E)-1-morpholino-3-(4-(2-(tetrahydro-2H-thiopyran-4-yloxy)phenylthio)-2,3-bis(trifluoromethyl)phenyl)prop-2-en-1-one | CHEMBL496738
TypeSmall organic molecule
Emp. Form.C26H25F6NO3S2
Mol. Mass.577.602
SMILESFC(F)(F)c1c(Sc2ccccc2OC2CCSCC2)ccc(\C=C\C(=O)N2CCOCC2)c1C(F)(F)F