Reaction Details
TargetIntegrin alpha-L
LigandBDBM50265321
Substrate/Competitorn/a
Meas. Tech.ChEMBL_497066 (CHEMBL997702)
IC50 18±n/a nM
Citation Lin, EYGuckian, KMSilvian, LChin, DBoriack-Sjodin, PAvan Vlijmen, HFriedman, JEScott, DM Structure-activity relationship of ortho- and meta-phenol based LFA-1 ICAM inhibitors. Bioorg Med Chem Lett18:5245-8 (2008) 
 
Integrin alpha-L
Name:Integrin alpha-L
Type:PROTEIN
Mol. Mass.:128748.90
Organism:Homo sapiens (Human)
Description:ChEMBL_629045
Residue:1170
BDBM50265321
NameBDBM50265321
Synonyms:(trans)-4-(3-(4-((E)-3-morpholino-3-oxoprop-1-enyl)-2,3-bis(trifluoromethyl)phenylthio)phenoxy)cyclohexanecarboxylic acid | CHEMBL499029
TypeSmall organic molecule
Emp. Form.C28H27F6NO5S
Mol. Mass.603.573
SMILESOC(=O)[C@H]1CC[C@@H](CC1)Oc1cccc(Sc2ccc(\C=C\C(=O)N3CCOCC3)c(c2C(F)(F)F)C(F)(F)F)c1