Reaction Details
TargetIntegrin alpha-L
LigandBDBM50264753
Substrate/Competitorn/a
Meas. Tech.ChEMBL_497066 (CHEMBL997702)
IC50 9.7±n/a nM
Citation Lin, EYGuckian, KMSilvian, LChin, DBoriack-Sjodin, PAvan Vlijmen, HFriedman, JEScott, DM Structure-activity relationship of ortho- and meta-phenol based LFA-1 ICAM inhibitors. Bioorg Med Chem Lett18:5245-8 (2008) 
 
Integrin alpha-L
Name:Integrin alpha-L
Type:PROTEIN
Mol. Mass.:128748.90
Organism:Homo sapiens (Human)
Description:ChEMBL_629045
Residue:1170
BDBM50264753
NameBDBM50264753
Synonyms:(E)-1-morpholino-3-(4-(2-(pyridin-2-ylmethoxy)phenylthio)-2,3-bis(trifluoromethyl)phenyl)prop-2-en-1-one | CHEMBL521385
TypeSmall organic molecule
Emp. Form.C27H22F6N2O3S
Mol. Mass.568.531
SMILESFC(F)(F)c1c(Sc2ccccc2OCc2ccccn2)ccc(\C=C\C(=O)N2CCOCC2)c1C(F)(F)F