Reaction Details
Target1-deoxy-D-xylulose-5-phosphate synthase
LigandBDBM50263875
Substrate/Competitorn/a
Meas. Tech.ChEMBL_535725 (CHEMBL989742)
IC50>200000±n/a nM
Citation Mao, JEoh, HHe, RWang, YWan, BFranzblau, SGCrick, DCKozikowski, AP Structure-activity relationships of compounds targeting mycobacterium tuberculosis 1-deoxy-D-xylulose 5-phosphate synthase. Bioorg Med Chem Lett18:5320-3 (2008) 
 
1-deoxy-D-xylulose-5-phosphate synthase
Name:1-deoxy-D-xylulose-5-phosphate synthase
Type:PROTEIN
Mol. Mass.:67882.02
Organism:Mycobacterium tuberculosis
Description:ChEMBL_1441273
Residue:638
BDBM50263875
NameBDBM50263875
Synonyms:5-(chloromethyl)-3-phenylpyrazolo[1,5-a]pyrimidin-7(4H)-one | CHEMBL491391
TypeSmall organic molecule
Emp. Form.C13H10ClN3O
Mol. Mass.259.691
SMILESClCc1cc(=O)n2[nH]cc(-c3ccccc3)c2n1