Reaction Details
Target1-deoxy-D-xylulose-5-phosphate synthase
LigandBDBM40457
Substrate/Competitorn/a
Meas. Tech.ChEMBL_535725 (CHEMBL989742)
IC50>200000±n/a nM
Citation Mao, JEoh, HHe, RWang, YWan, BFranzblau, SGCrick, DCKozikowski, AP Structure-activity relationships of compounds targeting mycobacterium tuberculosis 1-deoxy-D-xylulose 5-phosphate synthase. Bioorg Med Chem Lett18:5320-3 (2008) 
 
1-deoxy-D-xylulose-5-phosphate synthase
Name:1-deoxy-D-xylulose-5-phosphate synthase
Type:PROTEIN
Mol. Mass.:67882.02
Organism:Mycobacterium tuberculosis
Description:ChEMBL_1441273
Residue:638
BDBM40457
NameBDBM40457
Synonyms:3-(4-chlorophenyl)-5-methyl-6-(phenylmethyl)-2-(trifluoromethyl)-1H-pyrazolo[1,5-a]pyrimidin-7-one CHEMBL522818 cid_2211071
TypeSmall organic molecule
Emp. Form.C21H15ClF3N3O
Mol. Mass.417.812
SMILESCc1nc2c(c([nH]n2c(=O)c1Cc1ccccc1)C(F)(F)F)-c1ccc(Cl)cc1