Reaction Details
Target1-deoxy-D-xylulose-5-phosphate synthase
LigandBDBM50264092
Substrate/Competitorn/a
Meas. Tech.ChEMBL_535725 (CHEMBL989742)
IC50 19700±n/a nM
Citation Mao, JEoh, HHe, RWang, YWan, BFranzblau, SGCrick, DCKozikowski, AP Structure-activity relationships of compounds targeting mycobacterium tuberculosis 1-deoxy-D-xylulose 5-phosphate synthase. Bioorg Med Chem Lett18:5320-3 (2008) 
 
1-deoxy-D-xylulose-5-phosphate synthase
Name:1-deoxy-D-xylulose-5-phosphate synthase
Type:PROTEIN
Mol. Mass.:67882.02
Organism:Mycobacterium tuberculosis
Description:ChEMBL_1441273
Residue:638
BDBM50264092
NameBDBM50264092
Synonyms:3-(4-chlorophenyl)-2-ethyl-5-(4-methoxyphenyl)pyrazolo[1,5-a]pyrimidin-7(4H)-one | CHEMBL507286
TypeSmall organic molecule
Emp. Form.C21H18ClN3O2
Mol. Mass.379.84
SMILESCCc1[nH]n2c(nc(cc2=O)-c2ccc(OC)cc2)c1-c1ccc(Cl)cc1