Reaction Details
Target1-deoxy-D-xylulose-5-phosphate synthase
LigandBDBM50264091
Substrate/Competitorn/a
Meas. Tech.ChEMBL_535725 (CHEMBL989742)
IC50 17900±n/a nM
Citation Mao, JEoh, HHe, RWang, YWan, BFranzblau, SGCrick, DCKozikowski, AP Structure-activity relationships of compounds targeting mycobacterium tuberculosis 1-deoxy-D-xylulose 5-phosphate synthase. Bioorg Med Chem Lett18:5320-3 (2008) 
 
1-deoxy-D-xylulose-5-phosphate synthase
Name:1-deoxy-D-xylulose-5-phosphate synthase
Type:PROTEIN
Mol. Mass.:67882.02
Organism:Mycobacterium tuberculosis
Description:ChEMBL_1441273
Residue:638
BDBM50264091
NameBDBM50264091
Synonyms:2-methyl-3,5-diphenyl-6-propylpyrazolo[1,5-a]pyrimidin-7(4H)-one | CHEMBL522627
TypeSmall organic molecule
Emp. Form.C22H21N3O
Mol. Mass.343.4216
SMILESCCCc1c(nc2c(c(C)[nH]n2c1=O)-c1ccccc1)-c1ccccc1