Reaction Details
Target1-deoxy-D-xylulose-5-phosphate synthase
LigandBDBM50264034
Substrate/Competitorn/a
Meas. Tech.ChEMBL_535725 (CHEMBL989742)
IC50 53500±n/a nM
Citation Mao, JEoh, HHe, RWang, YWan, BFranzblau, SGCrick, DCKozikowski, AP Structure-activity relationships of compounds targeting mycobacterium tuberculosis 1-deoxy-D-xylulose 5-phosphate synthase. Bioorg Med Chem Lett18:5320-3 (2008) 
 
1-deoxy-D-xylulose-5-phosphate synthase
Name:1-deoxy-D-xylulose-5-phosphate synthase
Type:PROTEIN
Mol. Mass.:67882.02
Organism:Mycobacterium tuberculosis
Description:ChEMBL_1441273
Residue:638
BDBM50264034
NameBDBM50264034
Synonyms:3-(4-bromophenyl)-5-(2-methoxyphenyl)-2-methylpyrazolo[1,5-a]pyrimidin-7(4H)-one | CHEMBL522461
TypeSmall organic molecule
Emp. Form.C20H16BrN3O2
Mol. Mass.410.264
SMILESCOc1ccccc1-c1cc(=O)n2[nH]c(C)c(-c3ccc(Br)cc3)c2n1