Reaction Details
TargetEstrogen receptor beta
LigandBDBM50253387
Substrate/Competitorn/a
Meas. Tech.ChEMBL_539658 (CHEMBL1028193)
Ki>1000000±n/a nM
Citation Parent, AAGunther, JRKatzenellenbogen, JA Blocking estrogen signaling after the hormone: pyrimidine-core inhibitors of estrogen receptor-coactivator binding. J Med Chem51:6512-30 (2008) 
 
Estrogen receptor beta
Name:Estrogen receptor beta
Type:Protein
Mol. Mass.:59238.43
Organism:Homo sapiens (Human)
Description:Q92731
Residue:530
BDBM50253387
NameBDBM50253387
Synonyms:CHEMBL492665 | N2,N4-dimethyl-N2,N4-diisobutyl-(6-styryl-pyrimidin-2,4-yl)-diamine
TypeSmall organic molecule
Emp. Form.C22H32N4
Mol. Mass.352.5163
SMILESCC(C)CN(C)c1cc(\C=C\c2ccccc2)nc(n1)N(C)CC(C)C