Reaction Details
TargetEstrogen receptor beta
LigandBDBM50253386
Substrate/Competitorn/a
Meas. Tech.ChEMBL_539658 (CHEMBL1028193)
Ki>1000000±n/a nM
Citation Parent, AAGunther, JRKatzenellenbogen, JA Blocking estrogen signaling after the hormone: pyrimidine-core inhibitors of estrogen receptor-coactivator binding. J Med Chem51:6512-30 (2008) 
 
Estrogen receptor beta
Name:Estrogen receptor beta
Type:Protein
Mol. Mass.:59238.43
Organism:Homo sapiens (Human)
Description:Q92731
Residue:530
BDBM50253386
NameBDBM50253386
Synonyms:CHEMBL449931 | N2,N4-Dimethyl-N2,N4-diisobutyl-(6-isopentyl-pyrimidin-2,4-yl)-diamine
TypeSmall organic molecule
Emp. Form.C19H36N4
Mol. Mass.320.5159
SMILESCC(C)CCc1cc(nc(n1)N(C)CC(C)C)N(C)CC(C)C