Reaction Details
TargetEstrogen receptor
LigandBDBM50253428
Substrate/Competitorn/a
Meas. Tech.ChEMBL_539657 (CHEMBL1028192)
Ki>1000000±n/a nM
Citation Parent, AAGunther, JRKatzenellenbogen, JA Blocking estrogen signaling after the hormone: pyrimidine-core inhibitors of estrogen receptor-coactivator binding. J Med Chem51:6512-30 (2008) 
 
Estrogen receptor
Name:Estrogen receptor
Type:Protein
Mol. Mass.:66230.44
Organism:Homo sapiens (Human)
Description:P03372
Residue:595
BDBM50253428
NameBDBM50253428
Synonyms:2,4-dinaphthylen-1-ylmethylamino-6-isopentylpyrimidine | CHEMBL494320
TypeSmall organic molecule
Emp. Form.C31H32N4
Mol. Mass.460.6126
SMILESCC(C)CCc1cc(NCc2cccc3ccccc23)nc(NCc2cccc3ccccc23)n1