Reaction Details
TargetEstrogen receptor
LigandBDBM50253391
Substrate/Competitorn/a
Meas. Tech.ChEMBL_539657 (CHEMBL1028192)
Ki 2400±n/a nM
Citation Parent, AAGunther, JRKatzenellenbogen, JA Blocking estrogen signaling after the hormone: pyrimidine-core inhibitors of estrogen receptor-coactivator binding. J Med Chem51:6512-30 (2008) 
 
Estrogen receptor
Name:Estrogen receptor
Type:Protein
Mol. Mass.:66230.44
Organism:Homo sapiens (Human)
Description:P03372
Residue:595
BDBM50253391
NameBDBM50253391
Synonyms:CHEMBL495326 | N4-methyl-N2,N4-diisobutyl-6-[(2-naphthalen-1-yl-ethyl)-pyrimidin-2,4-yl]-diamine
TypeSmall organic molecule
Emp. Form.C25H34N4
Mol. Mass.390.5643
SMILESCC(C)CNc1nc(CCc2cccc3ccccc23)cc(n1)N(C)CC(C)C