Reaction Details
TargetEstrogen receptor
LigandBDBM50253367
Substrate/Competitorn/a
Meas. Tech.ChEMBL_539657 (CHEMBL1028192)
Ki 7900±n/a nM
Citation Parent, AAGunther, JRKatzenellenbogen, JA Blocking estrogen signaling after the hormone: pyrimidine-core inhibitors of estrogen receptor-coactivator binding. J Med Chem51:6512-30 (2008) 
 
Estrogen receptor
Name:Estrogen receptor
Type:Protein
Mol. Mass.:66230.44
Organism:Homo sapiens (Human)
Description:P03372
Residue:595
BDBM50253367
NameBDBM50253367
Synonyms:CHEMBL494491 | N2-Benzyl-N4-isobutyl-6-(3-methyl-butyl)-pyrimidine-2,4-diamine
TypeSmall organic molecule
Emp. Form.C20H30N4
Mol. Mass.326.479
SMILESCC(C)CCc1cc(NCC(C)C)nc(NCc2ccccc2)n1