Reaction Details
TargetEstrogen receptor
LigandBDBM50253431
Substrate/Competitorn/a
Meas. Tech.ChEMBL_539657 (CHEMBL1028192)
Ki 2500±n/a nM
Citation Parent, AAGunther, JRKatzenellenbogen, JA Blocking estrogen signaling after the hormone: pyrimidine-core inhibitors of estrogen receptor-coactivator binding. J Med Chem51:6512-30 (2008) 
 
Estrogen receptor
Name:Estrogen receptor
Type:Protein
Mol. Mass.:66230.44
Organism:Homo sapiens (Human)
Description:P03372
Residue:595
BDBM50253431
NameBDBM50253431
Synonyms:2,4-diisobutylamino-6-(1-naphthylethyl)-pyrimidine | CHEMBL522823
TypeSmall organic molecule
Emp. Form.C24H32N4
Mol. Mass.376.5377
SMILESCC(C)CNc1cc(CCc2cccc3ccccc23)nc(NCC(C)C)n1