Reaction Details
TargetAcetylcholinesterase
LigandBDBM8971
Substrate/Competitorn/a
Meas. Tech.ChEMBL_497074 (CHEMBL997710)
Ki 27.9±n/a nM
Citation Butini, SGuarino, ECampiani, GBrindisi, MCoccone, SSFiorini, INovellino, EBelinskaya, TSaxena, AGemma, S Tacrine based human cholinesterase inhibitors: synthesis of peptidic-tethered derivatives and their effect on potency and selectivity. Bioorg Med Chem Lett18:5213-6 (2008) 
 
Acetylcholinesterase
Name:Acetylcholinesterase
Type:Enzyme
Mol. Mass.:67792.70
Organism:Homo sapiens (Human)
Description:P22303
Residue:614
BDBM8971
NameBDBM8971
Synonyms:CHEMBL129108 Tacrine Dimer 4g
TypeSmall organic molecule
Emp. Form.C34H41N3S
Mol. Mass.523.774
SMILESC(CCCCSc1c2CCCCc2nc2ccccc12)CCCNc1c2CCCCc2nc2ccccc12