Reaction Details
Target11-beta-hydroxysteroid dehydrogenase 1
LigandBDBM50248569
Substrate/Competitorn/a
Meas. Tech.ChEMBL_536048 (CHEMBL991618)
Ki 1.1±n/a nM
Citation Tu, HPowers, JPLiu, JUrsu, SSudom, AYan, XXu, HMeininger, DDegraffenreid, MHe, XJaen, JCSun, DLabelle, MYamamoto, HShan, BWalker, NPWang, Z Distinctive molecular inhibition mechanisms for selective inhibitors of human 11beta-hydroxysteroid dehydrogenase type 1. Bioorg Med Chem16:8922-31 (2008) 
 
11-beta-hydroxysteroid dehydrogenase 1
Name:11-beta-hydroxysteroid dehydrogenase 1
Type:Enzyme
Mol. Mass.:32409.16
Organism:Homo sapiens (Human)
Description:P28845
Residue:292
BDBM50248569
NameBDBM50248569
Synonyms:(1-(((R)-3-methyl-4-(4-((S)-1,1,1-trifluoro-2-hydroxypropan-2-yl)phenylsulfonyl)-piperazin-1-yl)methyl)-cyclopropanecarboxamide) 1-{[(3R)-3-methyl-4-({4-[(1S)-2,2,2-trifluoro-1-hydroxy-1-methylethyl]phenyl}sulfonyl)piperazin-1-yl]methyl}cyclopropanecarboxamide | CHEMBL460962
TypeSmall organic molecule
Emp. Form.C19H26F3N3O4S
Mol. Mass.449.488
SMILESC[C@@H]1CN(CC2(CC2)C(N)=O)CCN1S(=O)(=O)c1ccc(cc1)[C@](C)(O)C(F)(F)F