Reaction Details
Target11-beta-hydroxysteroid dehydrogenase 1
LigandBDBM50263346
Substrate/Competitorn/a
Meas. Tech.ChEMBL_535788 (CHEMBL991553)
IC50 1.6±n/a nM
Citation Tu, HPowers, JPLiu, JUrsu, SSudom, AYan, XXu, HMeininger, DDegraffenreid, MHe, XJaen, JCSun, DLabelle, MYamamoto, HShan, BWalker, NPWang, Z Distinctive molecular inhibition mechanisms for selective inhibitors of human 11beta-hydroxysteroid dehydrogenase type 1. Bioorg Med Chem16:8922-31 (2008) 
 
11-beta-hydroxysteroid dehydrogenase 1
Name:11-beta-hydroxysteroid dehydrogenase 1
Type:Enzyme
Mol. Mass.:32409.16
Organism:Homo sapiens (Human)
Description:P28845
Residue:292
BDBM50263346
NameBDBM50263346
Synonyms:(3-(1-(4-fluorophenyl)cyclopropyl)-4-isopropyl-5-(4-(trifluoromethoxy)phenyl)-4H-1,2,4-triazole) CHEMBL476142
TypeSmall organic molecule
Emp. Form.C21H19F4N3O
Mol. Mass.405.3887
SMILESCC(C)n1c(nnc1C1(CC1)c1ccc(F)cc1)-c1ccc(OC(F)(F)F)cc1