Reaction Details
TargetCathepsin B
LigandBDBM50265074
Substrate/Competitorn/a
Meas. Tech.ChEMBL_497106 (CHEMBL998584)
Ki 94000±n/a nM
Citation Perlman, NHazan, MShokhen, MAlbeck, A Peptidyl epoxides extended in the P' direction as cysteine protease inhibitors: effect on affinity and mechanism of inhibition. Bioorg Med Chem16:9032-9 (2008) 
 
Cathepsin B
Name:Cathepsin B
Type:Enzyme
Mol. Mass.:37819.69
Organism:Homo sapiens (Human)
Description:gi_63102437
Residue:339
BDBM50265074
NameBDBM50265074
Synonyms:CHEMBL525792 | Cbz-Phe-[Gly-cis epoxy-Gly]-Ala-AlaOMe
TypeSmall organic molecule
Emp. Form.C29H36N4O8
Mol. Mass.568.6181
SMILESCOC(=O)[C@H](C)NC(=O)[C@H](C)NC(=O)C[C@H]1O[C@H]1CNC(=O)[C@H](Cc1ccccc1)NC(=O)OCc1ccccc1