Reaction Details
TargetNeuronal acetylcholine receptor subunit alpha-4
LigandBDBM50264763
Substrate/Competitorn/a
Meas. Tech.ChEMBL_497109 (CHEMBL998587)
EC50 130±n/a nM
Citation Albrecht, BKBerry, VBoezio, AACao, LClarkin, KGuo, WHarmange, JCHierl, MHuang, LJanosky, BKnop, JMalmberg, AMcDermott, JSNguyen, HQSpringer, SKWaldon, DWoodin, KMcDonough, SI Discovery and optimization of substituted piperidines as potent, selective, CNS-penetrant alpha4beta2 nicotinic acetylcholine receptor potentiators. Bioorg Med Chem Lett18:5209-12 (2008) 
 
Neuronal acetylcholine receptor subunit alpha-4
Name:Neuronal acetylcholine receptor subunit alpha-4
Type:n/a
Mol. Mass.:69963.49
Organism:Homo sapiens (Human)
Description:NACHRA4
Residue:627
BDBM50264763
NameBDBM50264763
Synonyms:3-(2-chlorothiophen-3-yl)-5-(1-(piperidin-4-yl)-1H-pyrazol-4-yl)isoxazole | CHEMBL523966
TypeSmall organic molecule
Emp. Form.C15H15ClN4OS
Mol. Mass.334.824
SMILESClc1sccc1-c1cc(on1)-c1cnn(c1)C1CCNCC1