Reaction Details
TargetNeuronal acetylcholine receptor subunit alpha-4
LigandBDBM50264798
Substrate/Competitorn/a
Meas. Tech.ChEMBL_497109 (CHEMBL998587)
EC50 33±n/a nM
Citation Albrecht, BKBerry, VBoezio, AACao, LClarkin, KGuo, WHarmange, JCHierl, MHuang, LJanosky, BKnop, JMalmberg, AMcDermott, JSNguyen, HQSpringer, SKWaldon, DWoodin, KMcDonough, SI Discovery and optimization of substituted piperidines as potent, selective, CNS-penetrant alpha4beta2 nicotinic acetylcholine receptor potentiators. Bioorg Med Chem Lett18:5209-12 (2008) 
 
Neuronal acetylcholine receptor subunit alpha-4
Name:Neuronal acetylcholine receptor subunit alpha-4
Type:n/a
Mol. Mass.:69963.49
Organism:Homo sapiens (Human)
Description:NACHRA4
Residue:627
BDBM50264798
NameBDBM50264798
Synonyms:3-(2-chlorophenyl)-5-(2-(piperidin-4-yl)thiazol-5-yl)isoxazole | CHEMBL522640
TypeSmall organic molecule
Emp. Form.C17H16ClN3OS
Mol. Mass.345.846
SMILESClc1ccccc1-c1cc(on1)-c1cnc(s1)C1CCNCC1