Reaction Details
TargetNeuronal acetylcholine receptor subunit alpha-3
LigandBDBM50264882
Substrate/Competitorn/a
Meas. Tech.ChEMBL_497108 (CHEMBL998586)
EC50>100000±n/a nM
Citation Albrecht, BKBerry, VBoezio, AACao, LClarkin, KGuo, WHarmange, JCHierl, MHuang, LJanosky, BKnop, JMalmberg, AMcDermott, JSNguyen, HQSpringer, SKWaldon, DWoodin, KMcDonough, SI Discovery and optimization of substituted piperidines as potent, selective, CNS-penetrant alpha4beta2 nicotinic acetylcholine receptor potentiators. Bioorg Med Chem Lett18:5209-12 (2008) 
 
Neuronal acetylcholine receptor subunit alpha-3
Name:Neuronal acetylcholine receptor subunit alpha-3
Type:Enzyme Catalytic Domain
Mol. Mass.:57479.03
Organism:Homo sapiens (Human)
Description:Cholinergic, Nicotinic Alpha3Beta2 0 HUMAN::P32297
Residue:505
BDBM50264882
NameBDBM50264882
Synonyms:CHEMBL497990 | N-((3-(2-chlorophenyl)isoxazol-5-yl)methyl)-N-methylpiperidine-4-carboxamide
TypeSmall organic molecule
Emp. Form.C17H20ClN3O2
Mol. Mass.333.813
SMILESCN(Cc1cc(no1)-c1ccccc1Cl)C(=O)C1CCNCC1