Reaction Details
TargetCollagenase 3
LigandBDBM26526
Substrate/Competitorn/a
Meas. Tech.ChEMBL_497406 (CHEMBL1002947)
Ki 1417±n/a nM
Citation Georgiadis, DYiotakis, A Specific targeting of metzincin family members with small-molecule inhibitors: progress toward a multifarious challenge. Bioorg Med Chem16:8781-94 (2008) 
 
Collagenase 3
Name:Collagenase 3
Type:Enzyme
Mol. Mass.:53808.06
Organism:Homo sapiens (Human)
Description:P45452
Residue:471
BDBM26526
NameBDBM26526
Synonyms:(2R)-N-hydroxy-2-[(3S)-3-methyl-3-{4-[(2-methylquinolin-4-yl)methoxy]phenyl}-2-oxopyrrolidin-1-yl]propanamide CHEMBL148169 | IK682
TypeSmall organic molecule
Emp. Form.C25H27N3O4
Mol. Mass.433.4996
SMILESC[C@@H](N1CC[C@](C)(C1=O)c1ccc(OCc2cc(C)nc3ccccc23)cc1)C(=O)NO