Reaction Details
TargetMacrophage metalloelastase
LigandBDBM26806
Substrate/Competitorn/a
Meas. Tech.ChEMBL_497414 (CHEMBL1002955)
IC50 8000±n/a nM
Citation Georgiadis, DYiotakis, A Specific targeting of metzincin family members with small-molecule inhibitors: progress toward a multifarious challenge. Bioorg Med Chem16:8781-94 (2008) 
 
Macrophage metalloelastase
Name:Macrophage metalloelastase
Type:Enzyme
Mol. Mass.:54012.99
Organism:Homo sapiens (Human)
Description:P39900
Residue:470
BDBM26806
NameBDBM26806
Synonyms:(3R,4R)-3-N-hydroxy-4-N-(4-{[2-(trifluoromethyl)-1H-1,3-benzodiazol-1-yl]methyl}benzene)oxane-3,4-diamido benzimidazole analog., 32
TypeSmall organic molecule
Emp. Form.C22H21F3N4O4
Mol. Mass.462.4217
SMILESONC(=O)[C@H]1COCC[C@H]1NC(=O)c1ccc(Cn2c(nc3ccccc23)C(F)(F)F)cc1