Reaction Details
TargetMatrix metalloproteinase-15
LigandBDBM26575
Substrate/Competitorn/a
Meas. Tech.ChEMBL_497444 (CHEMBL1005438)
Ki>7088±n/a nM
Citation Georgiadis, DYiotakis, A Specific targeting of metzincin family members with small-molecule inhibitors: progress toward a multifarious challenge. Bioorg Med Chem16:8781-94 (2008) 
 
Matrix metalloproteinase-15
Name:Matrix metalloproteinase-15
Type:PROTEIN
Mol. Mass.:75814.08
Organism:Homo sapiens (Human)
Description:ChEMBL_106793
Residue:669
BDBM26575
NameBDBM26575
Synonyms:(3R,4R)-3-N-hydroxy-4-N-(4-{[2-(trifluoromethyl)pyrazolo[1,5-a]pyridin-3-yl]methyl}benzene)oxane-3,4-dicarboxamide | pyrazolopyridine, 49
TypeSmall organic molecule
Emp. Form.C22H21F3N4O4
Mol. Mass.462.4217
SMILESONC(=O)[C@H]1COCC[C@H]1NC(=O)c1ccc(Cc2c(nn3ccccc23)C(F)(F)F)cc1