Reaction Details
TargetTyrosine-protein kinase Lck
LigandBDBM50263513
Substrate/Competitorn/a
Meas. Tech.ChEMBL_535871 (CHEMBL994991)
IC50 14±n/a nM
Citation Zhang, GRen, PGray, NSSim, TLiu, YWang, XChe, JTian, SSSandberg, MLSpalding, TARomeo, RIskandar, MChow, DMartin Seidel, HKaranewsky, DSHe, Y Discovery of pyrimidine benzimidazoles as Lck inhibitors: part I. Bioorg Med Chem Lett18:5618-21 (2008) 
 
Tyrosine-protein kinase Lck
Name:Tyrosine-protein kinase Lck
Type:n/a
Mol. Mass.:57987.83
Organism:Homo sapiens (Human)
Description:P06239
Residue:509
BDBM50263513
NameBDBM50263513
Synonyms:CHEMBL477172 | N-(2-chloro-6-methylphenyl)-1-(6-(4-(morpholinomethyl)pyridin-2-ylamino)pyrimidin-4-yl)-1H-benzo[d]imidazol-2-amine
TypeSmall organic molecule
Emp. Form.C28H27ClN8O
Mol. Mass.527.02
SMILESCc1cccc(Cl)c1Nc1nc2ccccc2n1-c1cc(Nc2cc(CN3CCOCC3)ccn2)ncn1