Reaction Details
TargetHeme oxygenase 1
LigandBDBM50252801
Substrate/Competitorn/a
Meas. Tech.ChEMBL_539041 (CHEMBL1035715)
IC50 3000±n/a nM
Citation Rahman, MNVlahakis, JZSzarek, WANakatsu, KJia, Z X-ray crystal structure of human heme oxygenase-1 in complex with 1-(adamantan-1-yl)-2-(1H-imidazol-1-yl)ethanone: a common binding mode for imidazole-based heme oxygenase-1 inhibitors. J Med Chem51:5943-52 (2008) 
 
Heme oxygenase 1
Name:Heme oxygenase 1
Type:Enzyme
Mol. Mass.:33005.15
Organism:Rattus norvegicus (rat)
Description:HO-1 obtained from rat spleen was used in enzyme assays.
Residue:289
BDBM50252801
NameBDBM50252801
Synonyms:1-(adamantan-1-yl)-2-(1H-imidazol-1-yl)ethanone hydrochloride | CHEMBL493448
TypeSmall organic molecule
Emp. Form.C15H20N2O
Mol. Mass.244.3321
SMILESO=C(Cn1ccnc1)C12CC3CC(CC(C3)C1)C2