Reaction Details
TargetAlpha-2B adrenergic receptor
LigandBDBM50263621
Substrate/Competitorn/a
Meas. Tech.ChEMBL_535910 (CHEMBL984462)
Ki 28±n/a nM
Citation Patel, SDHabeski, WMMin, HZhang, JRoof, RSnyder, BBora, GCampbell, BLi, CHidayetoglu, DJohnson, DSChaudhry, ACharlton, MEKablaoui, NM Identification and SAR around N-{2-[4-(2,3-dihydro-benzo[1,4]dioxin-2-ylmethyl)-[1,4]diazepan-1-yl]-ethyl}-2-phenoxy-nicotinamide, a selective alpha2C adrenergic receptor antagonist. Bioorg Med Chem Lett18:5689-93 (2008) 
 
Alpha-2B adrenergic receptor
Name:Alpha-2B adrenergic receptor
Type:Enzyme
Mol. Mass.:49964.20
Organism:Homo sapiens (Human)
Description:P18089
Residue:450
BDBM50263621
NameBDBM50263621
Synonyms:2-(3-cyanophenoxy)-N-(2-(4-((2,3-dihydrobenzo[b][1,4]dioxin-2-yl)methyl)-1,4-diazepan-1-yl)ethyl)nicotinamide | CHEMBL515331
TypeSmall organic molecule
Emp. Form.C29H31N5O4
Mol. Mass.513.5875
SMILESO=C(NCCN1CCCN(CC2COc3ccccc3O2)CC1)c1cccnc1Oc1cccc(c1)C#N