Reaction Details
TargetAlpha-2C adrenergic receptor
LigandBDBM50159018
Substrate/Competitorn/a
Meas. Tech.ChEMBL_535906 (CHEMBL983547)
Ki 20±n/a nM
Citation Patel, SDHabeski, WMMin, HZhang, JRoof, RSnyder, BBora, GCampbell, BLi, CHidayetoglu, DJohnson, DSChaudhry, ACharlton, MEKablaoui, NM Identification and SAR around N-{2-[4-(2,3-dihydro-benzo[1,4]dioxin-2-ylmethyl)-[1,4]diazepan-1-yl]-ethyl}-2-phenoxy-nicotinamide, a selective alpha2C adrenergic receptor antagonist. Bioorg Med Chem Lett18:5689-93 (2008) 
 
Alpha-2C adrenergic receptor
Name:Alpha-2C adrenergic receptor
Type:Enzyme
Mol. Mass.:49552.32
Organism:Homo sapiens (Human)
Description:P18825
Residue:462
BDBM50159018
NameBDBM50159018
Synonyms:1-Benzyl-4-chroman-2-ylmethyl-piperazine CHEMBL179648
TypeSmall organic molecule
Emp. Form.C21H26N2O
Mol. Mass.322.4439
SMILESC(C1CCc2ccccc2O1)N1CCN(Cc2ccccc2)CC1