Reaction Details
TargetTyrosine-protein kinase Fgr
LigandBDBM50094895
Substrate/Competitorn/a
Meas. Tech.ChEMBL_535977 (CHEMBL987151)
IC50 24000±n/a nM
Citation Cozza, GGianoncelli, AMontopoli, MCaparrotta, LVenerando, AMeggio, FPinna, LAZagotto, GMoro, S Identification of novel protein kinase CK1 delta (CK1delta) inhibitors through structure-based virtual screening. Bioorg Med Chem Lett18:5672-5 (2008) 
 
Tyrosine-protein kinase Fgr
Name:Tyrosine-protein kinase Fgr
Type:protein
Mol. Mass.:59469.88
Organism:Homo sapiens (Human)
Description:P09769
Residue:529
BDBM50094895
NameBDBM50094895
Synonyms:1,4-diamino-9,10-anthraquinone 1,4-diaminoanthracene-9,10-dione | CHEMBL86771
TypeSmall organic molecule
Emp. Form.C14H10N2O2
Mol. Mass.238.2414
SMILESNc1ccc(N)c2C(=O)c3ccccc3C(=O)c12