Reaction Details
TargetOxysterols receptor LXR-beta
LigandBDBM50252941
Substrate/Competitorn/a
Meas. Tech.ChEMBL_539729 (CHEMBL1032355)
IC50 30±n/a nM
Citation Chao, EYCaravella, JAWatson, MACampobasso, NGhisletti, SBillin, ANGalardi, CWang, PLaffitte, BAIannone, MAGoodwin, BJNichols, JAParks, DJStewart, EWiethe, RWWilliams, SPSmallwood, APearce, KHGlass, CKWillson, TMZuercher, WJCollins, JL Structure-guided design of N-phenyl tertiary amines as transrepression-selective liver X receptor modulators with anti-inflammatory activity. J Med Chem51:5758-65 (2008) 
 
Oxysterols receptor LXR-beta
Name:Oxysterols receptor LXR-beta
Type:Enzyme Catalytic Domain
Mol. Mass.:50978.79
Organism:Homo sapiens (Human)
Description:P55055
Residue:460
BDBM50252941
NameBDBM50252941
Synonyms:2-{4-[Butyl(3,5-dichlorobenzyl)amino]phenyl}-1,1,1,3,3,3-hexafluoropropan-2-ol | CHEMBL493242
TypeSmall organic molecule
Emp. Form.C20H19Cl2F6NO
Mol. Mass.474.267
SMILESCCCCN(Cc1cc(Cl)cc(Cl)c1)c1ccc(cc1)C(O)(C(F)(F)F)C(F)(F)F