Reaction Details
TargetOxysterols receptor LXR-beta
LigandBDBM50252815
Substrate/Competitorn/a
Meas. Tech.ChEMBL_539729 (CHEMBL1032355)
IC50 40±n/a nM
Citation Chao, EYCaravella, JAWatson, MACampobasso, NGhisletti, SBillin, ANGalardi, CWang, PLaffitte, BAIannone, MAGoodwin, BJNichols, JAParks, DJStewart, EWiethe, RWWilliams, SPSmallwood, APearce, KHGlass, CKWillson, TMZuercher, WJCollins, JL Structure-guided design of N-phenyl tertiary amines as transrepression-selective liver X receptor modulators with anti-inflammatory activity. J Med Chem51:5758-65 (2008) 
 
Oxysterols receptor LXR-beta
Name:Oxysterols receptor LXR-beta
Type:Enzyme Catalytic Domain
Mol. Mass.:50978.79
Organism:Homo sapiens (Human)
Description:P55055
Residue:460
BDBM50252815
NameBDBM50252815
Synonyms:2-{4-[Benzyl(butyl)amino]phenyl}-1,1,1,3,3,3-hexafluoropropan-2-ol | CHEMBL494676
TypeSmall organic molecule
Emp. Form.C20H21F6NO
Mol. Mass.405.3773
SMILESCCCCN(Cc1ccccc1)c1ccc(cc1)C(O)(C(F)(F)F)C(F)(F)F