Reaction Details
TargetOxysterols receptor LXR-alpha
LigandBDBM50252905
Substrate/Competitorn/a
Meas. Tech.ChEMBL_539728 (CHEMBL1032354)
IC50 190±n/a nM
Citation Chao, EYCaravella, JAWatson, MACampobasso, NGhisletti, SBillin, ANGalardi, CWang, PLaffitte, BAIannone, MAGoodwin, BJNichols, JAParks, DJStewart, EWiethe, RWWilliams, SPSmallwood, APearce, KHGlass, CKWillson, TMZuercher, WJCollins, JL Structure-guided design of N-phenyl tertiary amines as transrepression-selective liver X receptor modulators with anti-inflammatory activity. J Med Chem51:5758-65 (2008) 
 
Oxysterols receptor LXR-alpha
Name:Oxysterols receptor LXR-alpha
Type:Enzyme Catalytic Domain
Mol. Mass.:50403.85
Organism:Homo sapiens (Human)
Description:Q13133
Residue:447
BDBM50252905
NameBDBM50252905
Synonyms:2-[(Butyl{4-[2,2,2-trifluoro-1-hydroxy-1-(trifluoromethyl)ethyl]phenyl}amino)methyl]-4-(trifluoromethoxy)phenol | CHEMBL493468
TypeSmall organic molecule
Emp. Form.C21H20F9NO3
Mol. Mass.505.374
SMILESCCCCN(Cc1cc(OC(F)(F)F)ccc1O)c1ccc(cc1)C(O)(C(F)(F)F)C(F)(F)F