Reaction Details
Target5-hydroxytryptamine receptor 7
LigandBDBM50253208
Substrate/Competitorn/a
Meas. Tech.ChEMBL_539774 (CHEMBL1034992)
Ki 0.80±n/a nM
Citation Leopoldo, MLacivita, EDe Giorgio, PFracasso, CGuzzetti, SCaccia, SContino, MColabufo, NABerardi, FPerrone, R Structural modifications of N-(1,2,3,4-tetrahydronaphthalen-1-yl)-4-aryl-1-piperazinehexanamides: influence on lipophilicity and 5-HT7 receptor activity. Part III. J Med Chem51:5813-22 (2008) 
 
5-hydroxytryptamine receptor 7
Name:5-hydroxytryptamine receptor 7
Type:G Protein-Coupled Receptor (GPCR)
Mol. Mass.:49852.62
Organism:Rattus norvegicus (rat)
Description:Rat cloned 5-HT7R.
Residue:448
BDBM50253208
NameBDBM50253208
Synonyms:CHEMBL492871 | N-Benzyl-4-(2-diphenyl)-1-piperazinehexanamide
TypeSmall organic molecule
Emp. Form.C29H35N3O
Mol. Mass.441.6077
SMILESO=C(CCCCCN1CCN(CC1)c1ccccc1-c1ccccc1)NCc1ccccc1