Reaction Details
TargetPurine nucleoside phosphorylase
LigandBDBM22109
Substrate/Competitorn/a
Meas. Tech.ChEMBL_534711 (CHEMBL982800)
Ki 1.1±n/a nM
Citation Mason, JMMurkin, ASLi, LSchramm, VLGainsford, GJSkelton, BW A beta-fluoroamine inhibitor of purine nucleoside phosphorylase. J Med Chem51:5880-4 (2008) 
 
Purine nucleoside phosphorylase
Name:Purine nucleoside phosphorylase
Type:Enzyme
Mol. Mass.:32119.53
Organism:Homo sapiens (Human)
Description:n/a
Residue:289
BDBM22109
NameBDBM22109
Synonyms:7-{[(3R,4R)-3-hydroxy-4-(hydroxymethyl)pyrrolidin-1-yl]methyl}-1,5-dihydro-4H-pyrrolo[3,2-d]pyrimidin-4-one CHEMBL1213653 DADMe-ImmH,7
Typen/a
Emp. Form.C12H16N4O3
Mol. Mass.264.2804
SMILESOC[C@H]1CN(Cc2c[nH]c3c2nc[nH]c3=O)C[C@@H]1O