Reaction Details
TargetPurine nucleoside phosphorylase
LigandBDBM50247158
Substrate/Competitorn/a
Meas. Tech.ChEMBL_534711 (CHEMBL982800)
Ki 0.38±n/a nM
Citation Mason, JMMurkin, ASLi, LSchramm, VLGainsford, GJSkelton, BW A beta-fluoroamine inhibitor of purine nucleoside phosphorylase. J Med Chem51:5880-4 (2008) 
 
Purine nucleoside phosphorylase
Name:Purine nucleoside phosphorylase
Type:Enzyme
Mol. Mass.:32119.53
Organism:Homo sapiens (Human)
Description:n/a
Residue:289
BDBM50247158
NameBDBM50247158
Synonyms:7-(((3S,4S)-3-hydroxy-4-(hydroxymethyl)pyrrolidin-1-yl)methyl)-3H-pyrrolo[3,2-d]pyrimidin-4(5H)-one | CHEMBL454743
TypeSmall organic molecule
Emp. Form.C12H16N4O3
Mol. Mass.264.2804
SMILESOC[C@@H]1CN(Cc2c[nH]c3c2nc[nH]c3=O)C[C@H]1O