Reaction Details
TargetAdenosine receptor A3
LigandBDBM50252717
Substrate/Competitorn/a
Meas. Tech.ChEMBL_539463 (CHEMBL1028959)
Ki 7.3±n/a nM
Citation Jeong, LSPal, SChoe, SAChoi, WJJacobson, KAGao, ZGKlutz, AMHou, XKim, HOLee, HWLee, SKTosh, DKMoon, HR Structure-activity relationships of truncated D- and l-4'-thioadenosine derivatives as species-independent A3 adenosine receptor antagonists. J Med Chem51:6609-13 (2008) 
 
Adenosine receptor A3
Name:Adenosine receptor A3
Type:G Protein-Coupled Receptor (GPCR)
Mol. Mass.:36197.32
Organism:Homo sapiens (Human)
Description:P0DMS8
Residue:318
BDBM50252717
NameBDBM50252717
Synonyms:(2R,3R,4S)-2-(6-(3-Fluorobenzylamino)-9H-purin-9-yl)tetrahydrothiophene-3,4-diol | CHEMBL509055
TypeSmall organic molecule
Emp. Form.C16H16FN5O2S
Mol. Mass.361.394
SMILESO[C@@H]1CS[C@H]([C@@H]1O)n1cnc2c(NCc3cccc(F)c3)ncnc12