Reaction Details
TargetAdenosine receptor A3
LigandBDBM50252756
Substrate/Competitorn/a
Meas. Tech.ChEMBL_539465 (CHEMBL1028961)
Ki 6.3±n/a nM
Citation Jeong, LSPal, SChoe, SAChoi, WJJacobson, KAGao, ZGKlutz, AMHou, XKim, HOLee, HWLee, SKTosh, DKMoon, HR Structure-activity relationships of truncated D- and l-4'-thioadenosine derivatives as species-independent A3 adenosine receptor antagonists. J Med Chem51:6609-13 (2008) 
 
Adenosine receptor A3
Name:Adenosine receptor A3
Type:PROTEIN
Mol. Mass.:36643.73
Organism:Rattus norvegicus
Description:ChEMBL_479910
Residue:320
BDBM50252756
NameBDBM50252756
Synonyms:(2R,3R,4S)-2-(6-(3-Bromobenzylamino)-9H-purin-9-yl)-tetrahydrothiophene-3,4-diol | CHEMBL522856
TypeSmall organic molecule
Emp. Form.C16H16BrN5O2S
Mol. Mass.422.3
SMILESO[C@@H]1CS[C@H]([C@@H]1O)n1cnc2c(NCc3cccc(Br)c3)ncnc12