Reaction Details
TargetAdenosine receptor A3
LigandBDBM50252829
Substrate/Competitorn/a
Meas. Tech.ChEMBL_539465 (CHEMBL1028961)
Ki 1.86±n/a nM
Citation Jeong, LSPal, SChoe, SAChoi, WJJacobson, KAGao, ZGKlutz, AMHou, XKim, HOLee, HWLee, SKTosh, DKMoon, HR Structure-activity relationships of truncated D- and l-4'-thioadenosine derivatives as species-independent A3 adenosine receptor antagonists. J Med Chem51:6609-13 (2008) 
 
Adenosine receptor A3
Name:Adenosine receptor A3
Type:PROTEIN
Mol. Mass.:36643.73
Organism:Rattus norvegicus
Description:ChEMBL_479910
Residue:320
BDBM50252829
NameBDBM50252829
Synonyms:(2S,3S,4R,5R)-5-(6-(3-iodobenzylamino)-9H-purin-9-yl)-3,4-dihydroxy-N-methyl-tetrahydrothiophene-2-carboxamide N6-(3-Iodo-benzyl)-9-(5'-methylaminocarbonyl-4'-thiobeta-D-ribofuranosyl)adenine
TypeSmall organic molecule
Emp. Form.C18H19IN6O3S
Mol. Mass.526.351
SMILESCNC(=O)[C@H]1S[C@H]([C@H](O)[C@@H]1O)n1cnc2c(NCc3cccc(I)c3)ncnc12