Reaction Details
TargetCyclin-dependent kinase 2
LigandBDBM50274626
Substrate/Competitorn/a
Meas. Tech.ChEMBL_536407 (CHEMBL992478)
IC50 11±n/a nM
Citation Anderson, MAndrews, DMBarker, AJBrassington, CABreed, JByth, KFCulshaw, JDFinlay, MRFisher, EMcMiken, HHGreen, CPHeaton, DWNash, IANewcombe, NJOakes, SEPauptit, RARoberts, AStanway, JJThomas, APTucker, JAWalker, MWeir, HM Imidazoles: SAR and development of a potent class of cyclin-dependent kinase inhibitors. Bioorg Med Chem Lett18:5487-92 (2008) 
 
Cyclin-dependent kinase 2
Name:Cyclin-dependent kinase 2
Type:Enzyme Subunit
Mol. Mass.:33938.17
Organism:Homo sapiens (Human)
Description:P24941
Residue:298
BDBM50274626
NameBDBM50274626
Synonyms:4-(4-(1,2-dimethyl-1H-imidazol-5-yl)pyrimidin-2-ylamino)benzenesulfonamide | CHEMBL484738
TypeSmall organic molecule
Emp. Form.C15H16N6O2S
Mol. Mass.344.392
SMILESCc1ncc(-c2ccnc(Nc3ccc(cc3)S(N)(=O)=O)n2)n1C